Reaction Details
TargetMelanin-concentrating hormone receptor 1
LigandBDBM50188832
Substrate/Competitorn/a
Meas. Tech.ChEMBL_388718 (CHEMBL865483)
Ki 3.3±n/a nM
Citation Dyck, BZhao, LTamiya, JPontillo, JHudson, SChing, BHeise, CEWen, JNorton, CMadan, ASchwarz, DWade, WGoodfellow, VS Substituted chromones and quinolones as potent melanin-concentrating hormone receptor 1 antagonists. Bioorg Med Chem Lett16:4237-42 (2006) 
 
Melanin-concentrating hormone receptor 1
Name:Melanin-concentrating hormone receptor 1
Type:G Protein-Coupled Receptor (GPCR)
Mol. Mass.:45976.27
Organism:Homo sapiens (Human)
Description:Membranes from CHO-K1 cells stably expressing human MCH1R were used in assays.
Residue:422
BDBM50188832
NameBDBM50188832
Synonyms:3-(6-(3-(dimethylamino)pyrrolidin-1-yl)pyridin-3-yl)-7-(4-methoxy-2-methylphenyl)-4H-chromen-4-one | CHEMBL385141
TypeSmall organic molecule
Emp. Form.C28H29N3O3
Mol. Mass.455.5482
SMILESCOc1ccc(c(C)c1)-c1ccc2c(c1)occ(-c1ccc(nc1)N1CCC(C1)N(C)C)c2=O