Reaction Details
TargetMelanin-concentrating hormone receptor 1
LigandBDBM50188835
Substrate/Competitorn/a
Meas. Tech.ChEMBL_388718 (CHEMBL865483)
Ki 3±n/a nM
Citation Dyck, BZhao, LTamiya, JPontillo, JHudson, SChing, BHeise, CEWen, JNorton, CMadan, ASchwarz, DWade, WGoodfellow, VS Substituted chromones and quinolones as potent melanin-concentrating hormone receptor 1 antagonists. Bioorg Med Chem Lett16:4237-42 (2006) 
 
Melanin-concentrating hormone receptor 1
Name:Melanin-concentrating hormone receptor 1
Type:G Protein-Coupled Receptor (GPCR)
Mol. Mass.:45976.27
Organism:Homo sapiens (Human)
Description:Membranes from CHO-K1 cells stably expressing human MCH1R were used in assays.
Residue:422
BDBM50188835
NameBDBM50188835
Synonyms:7-(4-bromophenyl)-3-(6-(3-(dimethylamino)pyrrolidin-1-yl)pyridin-3-yl)-4H-chromen-4-one | CHEMBL378230
TypeSmall organic molecule
Emp. Form.C26H24BrN3O2
Mol. Mass.490.392
SMILESCN(C)C1CCN(C1)c1ccc(cn1)-c1coc2cc(ccc2c1=O)-c1ccc(Br)cc1