Reaction Details
TargetSodium-dependent noradrenaline transporter
LigandBDBM84745
Substrate/Competitorn/a
Meas. Tech.ChEMBL_390293 (CHEMBL869835)
IC50 19±n/a nM
Citation Jonathan Fray, MBish, GBrown, ADFish, PVStobie, AWakenhut, FWhitlock, GA N-(1,2-diphenylethyl)piperazines: a new class of dual serotonin/noradrenaline reuptake inhibitor. Bioorg Med Chem Lett16:4345-8 (2006) 
 
Sodium-dependent noradrenaline transporter
Name:Sodium-dependent noradrenaline transporter
Type:Multi-pass membrane protein
Mol. Mass.:69337.72
Organism:Homo sapiens (Human)
Description:P23975
Residue:617
BDBM84745
NameBDBM84745
Synonyms:CAS_136434-34-9 LY-248686 USRE49340, Rank 5
TypeSmall organic molecule
Emp. Form.C18H19NOS
Mol. Mass.297.415
SMILESCNCC[C@H](Oc1cccc2ccccc12)c1cccs1