Reaction Details
TargetNeuronal acetylcholine receptor subunit alpha-4/beta-2
LigandBDBM50135703
Substrate/Competitorn/a
Meas. Tech.ChEMBL_390600 (CHEMBL870982)
Ki 0.5±n/a nM
Citation Ragab, HMKim, JSDukat, MNavarro, HGlennon, RA Aryloxyethylamines: binding at alpha7 nicotinic acetylcholine receptors. Bioorg Med Chem Lett16:4283-6 (2006) 
 
Neuronal acetylcholine receptor subunit alpha-4/beta-2
Name:Neuronal acetylcholine receptor subunit alpha-4/beta-2
Type:Protein
Mol. Mass.:n/a
Description:n/a
Components:This complex has 2 components.
Component 1
Name:Neuronal acetylcholine receptor subunit alpha-4
Synonyms:ACHA4_HUMAN CHRNA4 protein Neuronal acetylcholine receptor protein alpha-4 subunit Nicotinic acetylcholine receptor alpha4/beta2/alpha5
Type:n/a
Mol. Mass.:69963.49
Organism:Homo sapiens (Human)
Description:NACHRA4
Residue:627
Component 2
Name:Neuronal acetylcholine receptor subunit beta-2
Synonyms:ACHB2_HUMAN Neuronal acetylcholine receptor protein beta-2 subunit | Nicotinic acetylcholine receptor alpha3/beta2/alpha5
Type:Protein
Mol. Mass.:57020.50
Organism:Homo sapiens (Human)
Description:P17787
Residue:502
BDBM50135703
NameBDBM50135703
Synonyms:CHEMBL345732 Trimethyl-[2-(pyridin-3-yloxy)-ethyl]-ammonium; chloride
TypeSmall organic molecule
Emp. Form.C10H17N2O
Mol. Mass.181.2542
SMILESC[N+](C)(C)CCOc1cccnc1