Reaction Details
TargetRNA-directed RNA polymerase
LigandBDBM50193053
Substrate/Competitorn/a
Meas. Tech.ChEMBL_391864 (CHEMBL862448)
IC50 180±n/a nM
Citation Beaulieu, PLGillard, JBykowski, DBrochu, CDansereau, NDuceppe, JSHaché, BJakalian, ALagacé, LLaPlante, SMcKercher, GMoreau, EPerreault, SStammers, TThauvette, LWarrington, JKukolj, G Improved replicon cellular activity of non-nucleoside allosteric inhibitors of HCV NS5B polymerase: from benzimidazole to indole scaffolds. Bioorg Med Chem Lett16:4987-93 (2006) 
 
RNA-directed RNA polymerase
Name:RNA-directed RNA polymerase
Type:Protein
Mol. Mass.:25173.95
Organism:Hepatitis C virus
Description:Q8JXU8
Residue:229
BDBM50193053
NameBDBM50193053
Synonyms:1-cyclohexyl-3-methyl-2-phenyl-1H-indole-5-carboxylic acid | CHEMBL215089
TypeSmall organic molecule
Emp. Form.C22H23NO2
Mol. Mass.333.4235
SMILESCc1c(-c2ccccc2)n(C2CCCCC2)c2ccc(cc12)C(O)=O