Reaction Details
TargetRNA-directed RNA polymerase
LigandBDBM50370756
Substrate/Competitorn/a
Meas. Tech.ChEMBL_391864 (CHEMBL862448)
IC50 150±n/a nM
Citation Beaulieu, PLGillard, JBykowski, DBrochu, CDansereau, NDuceppe, JSHaché, BJakalian, ALagacé, LLaPlante, SMcKercher, GMoreau, EPerreault, SStammers, TThauvette, LWarrington, JKukolj, G Improved replicon cellular activity of non-nucleoside allosteric inhibitors of HCV NS5B polymerase: from benzimidazole to indole scaffolds. Bioorg Med Chem Lett16:4987-93 (2006) 
 
RNA-directed RNA polymerase
Name:RNA-directed RNA polymerase
Type:Protein
Mol. Mass.:25173.95
Organism:Hepatitis C virus
Description:Q8JXU8
Residue:229
BDBM50370756
NameBDBM50370756
Synonyms:CHEMBL1789968
TypeSmall organic molecule
Emp. Form.C19H19NO3
Mol. Mass.309.3591
SMILESCc1c(-c2ccoc2)n(C2CCCC2)c2cc(ccc12)C(O)=O