Reaction Details
TargetRNA-directed RNA polymerase
LigandBDBM50193051
Substrate/Competitorn/a
Meas. Tech.ChEMBL_391864 (CHEMBL862448)
IC50 290±n/a nM
Citation Beaulieu, PLGillard, JBykowski, DBrochu, CDansereau, NDuceppe, JSHaché, BJakalian, ALagacé, LLaPlante, SMcKercher, GMoreau, EPerreault, SStammers, TThauvette, LWarrington, JKukolj, G Improved replicon cellular activity of non-nucleoside allosteric inhibitors of HCV NS5B polymerase: from benzimidazole to indole scaffolds. Bioorg Med Chem Lett16:4987-93 (2006) 
 
RNA-directed RNA polymerase
Name:RNA-directed RNA polymerase
Type:Protein
Mol. Mass.:25173.95
Organism:Hepatitis C virus
Description:Q8JXU8
Residue:229
BDBM50193051
NameBDBM50193051
Synonyms:7-chloro-3-cyclopentyl-2-(furan-3-yl)-1-methyl-1H-indole-6-carboxylic acid | CHEMBL214595
TypeSmall organic molecule
Emp. Form.C19H18ClNO3
Mol. Mass.343.804
SMILESCn1c(-c2ccoc2)c(C2CCCC2)c2ccc(C(O)=O)c(Cl)c12