Reaction Details
TargetAcetylcholinesterase
LigandBDBM50200334
Substrate/Competitorn/a
Meas. Tech.ChEMBL_410401 (CHEMBL911221)
IC50 1.15±n/a nM
Citation Camps, PGómez, EMuñoz-Torrero, DBadia, AClos, MVCurutchet, CMuñoz-Muriedas, JLuque, FJ Binding of 13-amidohuprines to acetylcholinesterase: exploring the ligand-induced conformational change of the gly117-gly118 peptide bond in the oxyanion hole. J Med Chem49:6833-40 (2006) 
 
Acetylcholinesterase
Name:Acetylcholinesterase
Type:Enzyme
Mol. Mass.:67659.62
Organism:Bos taurus (bovine)
Description:n/a
Residue:613
BDBM50200334
NameBDBM50200334
Synonyms:(-)-(7S,11S)-huprine H3
TypeSmall organic molecule
Emp. Form.C17H18ClN2
Mol. Mass.285.791
SMILESCC1=C[C@H]2C[C@@H](C1)c1c(C2)[nH+]c2cc(Cl)ccc2c1N