Reaction Details
TargetAcetylcholinesterase
LigandBDBM10592
Substrate/Competitorn/a
Meas. Tech.ChEMBL_410401 (CHEMBL911221)
IC50 4.23±n/a nM
Citation Camps, PGómez, EMuñoz-Torrero, DBadia, AClos, MVCurutchet, CMuñoz-Muriedas, JLuque, FJ Binding of 13-amidohuprines to acetylcholinesterase: exploring the ligand-induced conformational change of the gly117-gly118 peptide bond in the oxyanion hole. J Med Chem49:6833-40 (2006) 
 
Acetylcholinesterase
Name:Acetylcholinesterase
Type:Enzyme
Mol. Mass.:67659.62
Organism:Bos taurus (bovine)
Description:n/a
Residue:613
BDBM10592
NameBDBM10592
Synonyms:7-chloro-15-methyl-10-azatetracyclo[11.3.1.0^{2,11}.0^{4,9}]heptadeca-2,4(9),5,7,10,14-hexaen-3-amine Huprine Y.HCl | US9238626, (+/-)-Huprine Y HCl
TypeSmall organic molecule
Emp. Form.C17H17ClN2
Mol. Mass.284.783
SMILESCC1=CC2CC(C1)c1c(C2)nc2cc(Cl)ccc2c1N