Reaction Details
TargetCannabinoid receptor 2
LigandBDBM50200164
Substrate/Competitorn/a
Meas. Tech.ChEMBL_422554 (CHEMBL911053)
Ki 3000±n/a nM
Citation Murineddu, GLazzari, PRuiu, SSanna, ALoriga, GManca, IFalzoi, MDessì, CCurzu, MMChelucci, GPani, LPinna, GA Tricyclic pyrazoles. 4. Synthesis and biological evaluation of analogues of the robust and selective CB2 cannabinoid ligand 1-(2',4'-dichlorophenyl)-6-methyl-N-piperidin-1-yl-1,4-dihydroindeno[1,2-c]pyrazole-3-carboxamide. J Med Chem49:7502-12 (2006) 
 
Cannabinoid receptor 2
Name:Cannabinoid receptor 2
Type:Enzyme Catalytic Domain
Mol. Mass.:38220.43
Organism:MOUSE
Description:P47936
Residue:347
BDBM50200164
NameBDBM50200164
Synonyms:1-(2',4'-dichlorophenyl)-6-methyl-N-p-methoxyphenyl-1,4-dihydroindeno[1,2-c]pyrazole-3-carbohydrazide | CHEMBL218432
TypeSmall organic molecule
Emp. Form.C25H20Cl2N4O2
Mol. Mass.479.358
SMILESCOc1ccc(NNC(=O)c2nn(c-3c2Cc2cc(C)ccc-32)-c2ccc(Cl)cc2Cl)cc1