Reaction Details
TargetP-selectin glycoprotein ligand 1
LigandBDBM50324667
Substrate/Competitorn/a
Meas. Tech.ChEMBL_423294 (CHEMBL855465)
IC50 70000±n/a nM
Citation Kaila, NJanz, KDeBernardo, SBedard, PWCamphausen, RTTam, STsao, DHKeith, JCNickerson-Nutter, CShilling, AYoung-Sciame, RWang, Q Synthesis and biological evaluation of quinoline salicylic acids as P-selectin antagonists. J Med Chem50:21-39 (2007) 
 
P-selectin glycoprotein ligand 1
Name:P-selectin glycoprotein ligand 1
Type:PROTEIN
Mol. Mass.:43174.76
Organism:Homo sapiens (Human)
Description:ChEMBL_649756
Residue:412
BDBM50324667
NameBDBM50324667
Synonyms:1,6-bis[3-(3-carboxymethylphenyl)-4-(2-R-D-mannopyranosyloxy)phenyl]hexane TBC-1269
TypeSmall organic molecule
Emp. Form.C46H54O16
Mol. Mass.862.9114
SMILESOC[C@H]1O[C@H](Oc2ccc(CCCCCCc3ccc(O[C@H]4O[C@H](CO)[C@@H](O)[C@H](O)[C@@H]4O)c(c3)-c3cccc(CC(O)=O)c3)cc2-c2cccc(CC(O)=O)c2)[C@@H](O)[C@@H](O)[C@@H]1O