Reaction Details
TargetP-selectin glycoprotein ligand 1
LigandBDBM50201901
Substrate/Competitorn/a
Meas. Tech.ChEMBL_423294 (CHEMBL855465)
IC50 200000±n/a nM
Citation Kaila, NJanz, KDeBernardo, SBedard, PWCamphausen, RTTam, STsao, DHKeith, JCNickerson-Nutter, CShilling, AYoung-Sciame, RWang, Q Synthesis and biological evaluation of quinoline salicylic acids as P-selectin antagonists. J Med Chem50:21-39 (2007) 
 
P-selectin glycoprotein ligand 1
Name:P-selectin glycoprotein ligand 1
Type:PROTEIN
Mol. Mass.:43174.76
Organism:Homo sapiens (Human)
Description:ChEMBL_649756
Residue:412
BDBM50201901
NameBDBM50201901
Synonyms:2-(4-chlorophenyl)-3-hydroxy-8-phenylquinoline-4-carboxylicacid | CHEMBL218583
TypeSmall organic molecule
Emp. Form.C22H14ClNO3
Mol. Mass.375.804
SMILESOC(=O)c1c(O)c(nc2c(cccc12)-c1ccccc1)-c1ccc(Cl)cc1