Reaction Details
TargetP-selectin glycoprotein ligand 1
LigandBDBM50201912
Substrate/Competitorn/a
Meas. Tech.ChEMBL_423294 (CHEMBL855465)
IC50 3500000±n/a nM
Citation Kaila, NJanz, KDeBernardo, SBedard, PWCamphausen, RTTam, STsao, DHKeith, JCNickerson-Nutter, CShilling, AYoung-Sciame, RWang, Q Synthesis and biological evaluation of quinoline salicylic acids as P-selectin antagonists. J Med Chem50:21-39 (2007) 
 
P-selectin glycoprotein ligand 1
Name:P-selectin glycoprotein ligand 1
Type:PROTEIN
Mol. Mass.:43174.76
Organism:Homo sapiens (Human)
Description:ChEMBL_649756
Residue:412
BDBM50201912
NameBDBM50201912
Synonyms:3-hydroxy-2-(4-hydroxyphenyl)-7,8-dimethylquinoline-4-carboxylicacid | CHEMBL374961
TypeSmall organic molecule
Emp. Form.C18H15NO4
Mol. Mass.309.316
SMILESCc1ccc2c(C(O)=O)c(O)c(nc2c1C)-c1ccc(O)cc1