Reaction Details
TargetP-selectin glycoprotein ligand 1
LigandBDBM50201929
Substrate/Competitorn/a
Meas. Tech.ChEMBL_423294 (CHEMBL855465)
IC50 1500000±n/a nM
Citation Kaila, NJanz, KDeBernardo, SBedard, PWCamphausen, RTTam, STsao, DHKeith, JCNickerson-Nutter, CShilling, AYoung-Sciame, RWang, Q Synthesis and biological evaluation of quinoline salicylic acids as P-selectin antagonists. J Med Chem50:21-39 (2007) 
 
P-selectin glycoprotein ligand 1
Name:P-selectin glycoprotein ligand 1
Type:PROTEIN
Mol. Mass.:43174.76
Organism:Homo sapiens (Human)
Description:ChEMBL_649756
Residue:412
BDBM50201929
NameBDBM50201929
Synonyms:2-(4-chlorophenyl)-3,6-dihydroxyquinoline-4-carboxylic acid | CHEMBL374358
TypeSmall organic molecule
Emp. Form.C16H10ClNO4
Mol. Mass.315.708
SMILESOC(=O)c1c(O)c(nc2ccc(O)cc12)-c1ccc(Cl)cc1