Reaction Details
TargetP-selectin glycoprotein ligand 1
LigandBDBM50201931
Substrate/Competitorn/a
Meas. Tech.ChEMBL_423294 (CHEMBL855465)
IC50 125000±n/a nM
Citation Kaila, NJanz, KDeBernardo, SBedard, PWCamphausen, RTTam, STsao, DHKeith, JCNickerson-Nutter, CShilling, AYoung-Sciame, RWang, Q Synthesis and biological evaluation of quinoline salicylic acids as P-selectin antagonists. J Med Chem50:21-39 (2007) 
 
P-selectin glycoprotein ligand 1
Name:P-selectin glycoprotein ligand 1
Type:PROTEIN
Mol. Mass.:43174.76
Organism:Homo sapiens (Human)
Description:ChEMBL_649756
Residue:412
BDBM50201931
NameBDBM50201931
Synonyms:6-bromo-2-(4-chlorophenyl)-3-hydroxy-8-methylquinoline-4-carboxylic acid | CHEMBL218051
TypeSmall organic molecule
Emp. Form.C17H11BrClNO3
Mol. Mass.392.631
SMILESCc1cc(Br)cc2c(C(O)=O)c(O)c(nc12)-c1ccc(Cl)cc1