Reaction Details
TargetP-selectin glycoprotein ligand 1
LigandBDBM50201944
Substrate/Competitorn/a
Meas. Tech.ChEMBL_423294 (CHEMBL855465)
IC50 200000±n/a nM
Citation Kaila, NJanz, KDeBernardo, SBedard, PWCamphausen, RTTam, STsao, DHKeith, JCNickerson-Nutter, CShilling, AYoung-Sciame, RWang, Q Synthesis and biological evaluation of quinoline salicylic acids as P-selectin antagonists. J Med Chem50:21-39 (2007) 
 
P-selectin glycoprotein ligand 1
Name:P-selectin glycoprotein ligand 1
Type:PROTEIN
Mol. Mass.:43174.76
Organism:Homo sapiens (Human)
Description:ChEMBL_649756
Residue:412
BDBM50201944
NameBDBM50201944
Synonyms:3-hydroxy-7,8-dimethyl-2-(3-(trifluoromethoxy)phenyl)quinoline-4-carboxylic acid | CHEMBL218465
TypeSmall organic molecule
Emp. Form.C19H14F3NO4
Mol. Mass.377.314
SMILESCc1ccc2c(C(O)=O)c(O)c(nc2c1C)-c1cccc(OC(F)(F)F)c1