Reaction Details
TargetUDP-N-acetylglucosamine 1-carboxyvinyltransferase
LigandBDBM50194428
Substrate/Competitorn/a
Meas. Tech.ChEMBL_424366 (CHEMBL911297)
IC50 19800±n/a nM
Citation Bachelier, AMayer, RKlein, CD Sesquiterpene lactones are potent and irreversible inhibitors of the antibacterial target enzyme MurA. Bioorg Med Chem Lett16:5605-9 (2006) 
 
UDP-N-acetylglucosamine 1-carboxyvinyltransferase
Name:UDP-N-acetylglucosamine 1-carboxyvinyltransferase
Type:Protein
Mol. Mass.:44640.67
Organism:Pseudomonas aeruginosa (G-proteobacteria)
Description:P. aeruginosa MurA
Residue:421
BDBM50194428
NameBDBM50194428
Synonyms:CHEMBL221283 | eupatoriopicrin
TypeSmall organic molecule
Emp. Form.C20H26O6
Mol. Mass.362.4168
SMILESC\C1=C/[C@H]2OC(=O)C(=C)[C@@H]2[C@@H](CC(C)=CCC1)OC(=O)C(\CO)=C\CO