Reaction Details
TargetSodium- and chloride-dependent glycine transporter 1
LigandBDBM50195173
Substrate/Competitorn/a
Meas. Tech.ChEMBL_424804 (CHEMBL909053)
IC50 29±n/a nM
Citation Zhao, ZO'Brien, JALemaire, WWilliams, DLJacobson, MASur, CPettibone, DJTiller, PRSmith, SHartman, GDWolkenberg, SELindsley, CW Synthesis and SAR of GlyT1 inhibitors derived from a series of N-((4-(morpholine-4-carbonyl)-1-(propylsulfonyl)piperidin-4-yl)methyl)benzamides. Bioorg Med Chem Lett16:5968-72 (2006) 
 
Sodium- and chloride-dependent glycine transporter 1
Name:Sodium- and chloride-dependent glycine transporter 1
Type:PROTEIN
Mol. Mass.:76552.86
Organism:Mus musculus
Description:ChEMBL_1351579
Residue:692
BDBM50195173
NameBDBM50195173
Synonyms:2-chloro-4-fluoro-N-((4-(morpholine-4-carbonyl)-1-(propylsulfonyl)piperidin-4-yl)methyl)benzamide | CHEMBL222899
TypeSmall organic molecule
Emp. Form.C21H29ClFN3O5S
Mol. Mass.489.988
SMILESCCCS(=O)(=O)N1CCC(CNC(=O)c2ccc(F)cc2Cl)(CC1)C(=O)N1CCOCC1