Reaction Details
TargetEctonucleoside triphosphate diphosphohydrolase 2
LigandBDBM50029031
Substrate/Competitorn/a
Meas. Tech.ChEMBL_424931 (CHEMBL911343)
Ki 24200±n/a nM
Citation Müller, CEIqbal, JBaqi, YZimmermann, HRöllich, AStephan, H Polyoxometalates--a new class of potent ecto-nucleoside triphosphate diphosphohydrolase (NTPDase) inhibitors. Bioorg Med Chem Lett16:5943-7 (2006) 
 
Ectonucleoside triphosphate diphosphohydrolase 2
Name:Ectonucleoside triphosphate diphosphohydrolase 2
Type:PROTEIN
Mol. Mass.:54401.50
Organism:Rattus norvegicus
Description:ChEMBL_612639
Residue:495
BDBM50029031
NameBDBM50029031
Synonyms:1-Amino-4-{4-[4-chloro-6-(3-sulfo-phenylamino)-[1,3,5]triazin-2-ylamino]-3-sulfo-phenylamino}-9,10-dioxo-9,10-dihydro-anthracene-2-sulfonic acid1-Amino-4-{4-[4-chloro-6-(4-sulfo-phenylamino)-[1,3,5]triazin-2-ylamino]-3-sulfo-phenylamino}-9,10-dioxo-9,10-dihydro-anthracene-2-sulfonic acid CID44285648 cibacron blue (mixer, meta and para isomers
TypeSmall organic molecule
Emp. Form.C29H17ClN7O11S3
Mol. Mass.771.135
SMILESNc1c(cc(Nc2ccc(Nc3nc(Cl)nc(Nc4cccc(c4)S([O-])(=O)=O)n3)c(c2)S([O-])(=O)=O)c2C(=O)c3ccccc3C(=O)c12)S([O-])(=O)=O