Reaction Details
TargetNAD(P)H dehydrogenase [quinone] 1
LigandBDBM50195864
Substrate/Competitorn/a
Meas. Tech.ChEMBL_425055 (CHEMBL911952)
IC50 22500±n/a nM
Citation Nolan, KATimson, DJStratford, IJBryce, RA In silico identification and biochemical characterization of novel inhibitors of NQO1. Bioorg Med Chem Lett16:6246-54 (2006) 
 
NAD(P)H dehydrogenase [quinone] 1
Name:NAD(P)H dehydrogenase [quinone] 1
Type:Homodimer
Mol. Mass.:30874.82
Organism:Homo sapiens (Human)
Description:n/a
Residue:274
BDBM50195864
NameBDBM50195864
Synonyms:CHEMBL223702 | NSC-25415
TypeSmall organic molecule
Emp. Form.C11H8N2O
Mol. Mass.184.194
SMILESCOc1ccc2nc(ccc2c1)C#N