Reaction Details
TargetLiver carboxylesterase 1
LigandBDBM50204483
Substrate/Competitorn/a
Meas. Tech.ChEMBL_428057 (CHEMBL914371)
IC50 200±n/a nM
Citation Romero, FADu, WHwang, IRayl, TJKimball, FSLeung, DHoover, HSApodaca, RLBreitenbucher, JGCravatt, BFBoger, DL Potent and selective alpha-ketoheterocycle-based inhibitors of the anandamide and oleamide catabolizing enzyme, fatty acid amide hydrolase. J Med Chem50:1058-68 (2007) 
 
Liver carboxylesterase 1
Name:Liver carboxylesterase 1
Type:Protein
Mol. Mass.:62520.83
Organism:Homo sapiens (Human)
Description:n/a
Residue:567
BDBM50204483
NameBDBM50204483
Synonyms:7-phenyl-1-(5-(trifluoromethyl)oxazol-2-yl)heptan-1-one | CHEMBL373606
TypeSmall organic molecule
Emp. Form.C17H18F3NO2
Mol. Mass.325.3255
SMILESFC(F)(F)c1cnc(o1)C(=O)CCCCCCc1ccccc1