Reaction Details
TargetAdenosine receptor A2a
LigandBDBM50156640
Substrate/Competitorn/a
Meas. Tech.ChEMBL_429600 (CHEMBL919032)
Ki 4±n/a nM
Citation Peng, HKumaravel, GYao, GSha, LWang, JVan Vlijmen, HBohnert, THuang, CVu, CBEnsinger, CLChang, HEngber, TMWhalley, ETPetter, RC Novel bicyclic piperazine derivatives of triazolotriazine and triazolopyrimidines as highly potent and selective adenosine A2A receptor antagonists. J Med Chem47:6218-29 (2004) 
 
Adenosine receptor A2a
Name:Adenosine receptor A2a
Type:G Protein-Coupled Receptor (GPCR)
Mol. Mass.:45015.65
Organism:Rattus norvegicus (rat)
Description:Rat A2A receptors expressed in CHO cells.
Residue:410
BDBM50156640
NameBDBM50156640
Synonyms:(7RS,9aRS)-5-[7-(3-fluoro-phenoxymethyl)-octahydro-pyrido[1,2-a]pyrazin-2-yl]-2-furan-2-yl-[1,2,4]triazolo[1,5-a][1,3,5]triazin-7-ylamine | CHEMBL223745
TypeSmall organic molecule
Emp. Form.C23H25FN8O2
Mol. Mass.464.4954
SMILESNc1nc(nc2nc(nn12)-c1ccco1)N1CCN2C[C@@H](COc3ccc(F)cc3)CC[C@H]2C1