Reaction Details
TargetThymidylate synthase
LigandBDBM18771
Substrate/Competitorn/a
Meas. Tech.ChEMBL_430413 (CHEMBL916822)
IC50 72±n/a nM
Citation Gangjee, AJain, HDMcGuire, JJKisliuk, RL Benzoyl ring halogenated classical 2-amino-6-methyl-3,4-dihydro-4-oxo-5-substituted thiobenzoyl-7H-pyrrolo[2,3-d]pyrimidine antifolates as inhibitors of thymidylate synthase and as antitumor agents. J Med Chem47:6730-9 (2004) 
 
Thymidylate synthase
Name:Thymidylate synthase
Type:n/a
Mol. Mass.:30487.86
Organism:Escherichia coli
Description:n/a
Residue:264
BDBM18771
NameBDBM18771
Synonyms:(2S)-2-[(4-{[(2-amino-4-oxo-1,4-dihydroquinazolin-6-yl)methyl](prop-2-yn-1-yl)amino}phenyl)formamido]pentanedioic acid CHEMBL389051 | PDDF
TypeSmall organic molecule
Emp. Form.C24H23N5O6
Mol. Mass.477.4693
SMILESNc1nc2ccc(CN(CC#C)c3ccc(cc3)C(=O)N[C@@H](CCC(O)=O)C(O)=O)cc2c(=O)[nH]1