Reaction Details
TargetPhenylethanolamine N-methyltransferase
LigandBDBM14060
Substrate/Competitorn/a
Meas. Tech.ChEMBL_430874 (CHEMBL913943)
Ki 40±n/a nM
Citation Wu, QGee, CLLin, FTyndall, JDMartin, JLGrunewald, GLMcLeish, MJ Structural, mutagenic, and kinetic analysis of the binding of substrates and inhibitors of human phenylethanolamine N-methyltransferase. J Med Chem48:7243-52 (2005) 
 
Phenylethanolamine N-methyltransferase
Name:Phenylethanolamine N-methyltransferase
Type:Enzyme
Mol. Mass.:30852.66
Organism:Homo sapiens (Human)
Description:n/a
Residue:282
BDBM14060
NameBDBM14060
Synonyms:7-Iodo-1,2,3,4-tetrahydroisoquinoline tetrahydroisoquinoline (THIQ) deriv. 2
TypeSmall organic molecule
Emp. Form.C9H10IN
Mol. Mass.259.0869
SMILESIc1ccc2CCNCc2c1