Reaction Details
TargetTripeptidyl-peptidase 2
LigandBDBM50176918
Substrate/Competitorn/a
Meas. Tech.ChEMBL_430943 (CHEMBL914885)
Ki 6±n/a nM
Citation Ganellin, CRBishop, PBBambal, RBChan, SMLeblond, BMoore, ANZhao, LBourgeat, PRose, CVargas, FSchwartz, JC Inhibitors of tripeptidyl peptidase II. 3. Derivation of butabindide by successive structure optimizations leading to a potential general approach to designing exopeptidase inhibitors. J Med Chem48:7333-42 (2005) 
 
Tripeptidyl-peptidase 2
Name:Tripeptidyl-peptidase 2
Type:PROTEIN
Mol. Mass.:138287.08
Organism:Rattus norvegicus
Description:ChEMBL_211948
Residue:1249
BDBM50176918
NameBDBM50176918
Synonyms:(2S)-aminobutyryl-(2S)-indoline carboxylic acid propylamide | CHEMBL389419
TypeSmall organic molecule
Emp. Form.C16H23N3O2
Mol. Mass.289.3727
SMILESCCCNC(=O)[C@@H]1Cc2ccccc2N1C(=O)[C@@H](N)CC