Reaction Details
TargetTripeptidyl-peptidase 2
LigandBDBM50176924
Substrate/Competitorn/a
Meas. Tech.ChEMBL_430943 (CHEMBL914885)
Ki 4300±n/a nM
Citation Ganellin, CRBishop, PBBambal, RBChan, SMLeblond, BMoore, ANZhao, LBourgeat, PRose, CVargas, FSchwartz, JC Inhibitors of tripeptidyl peptidase II. 3. Derivation of butabindide by successive structure optimizations leading to a potential general approach to designing exopeptidase inhibitors. J Med Chem48:7333-42 (2005) 
 
Tripeptidyl-peptidase 2
Name:Tripeptidyl-peptidase 2
Type:PROTEIN
Mol. Mass.:138287.08
Organism:Rattus norvegicus
Description:ChEMBL_211948
Residue:1249
BDBM50176924
NameBDBM50176924
Synonyms:CHEMBL224341 | L-isoleucyl-L-prolinamide
TypeSmall organic molecule
Emp. Form.C11H21N3O2
Mol. Mass.227.3033
SMILESCCC(C)[C@H](N)C(=O)N1CCC[C@H]1C(N)=O