Reaction Details
TargetTripeptidyl-peptidase 2
LigandBDBM50176932
Substrate/Competitorn/a
Meas. Tech.ChEMBL_430943 (CHEMBL914885)
Ki 570±n/a nM
Citation Ganellin, CRBishop, PBBambal, RBChan, SMLeblond, BMoore, ANZhao, LBourgeat, PRose, CVargas, FSchwartz, JC Inhibitors of tripeptidyl peptidase II. 3. Derivation of butabindide by successive structure optimizations leading to a potential general approach to designing exopeptidase inhibitors. J Med Chem48:7333-42 (2005) 
 
Tripeptidyl-peptidase 2
Name:Tripeptidyl-peptidase 2
Type:PROTEIN
Mol. Mass.:138287.08
Organism:Rattus norvegicus
Description:ChEMBL_211948
Residue:1249
BDBM50176932
NameBDBM50176932
Synonyms:(2S)-aminobutyryl-L-prolinamide | CHEMBL224063
TypeSmall organic molecule
Emp. Form.C9H17N3O2
Mol. Mass.199.2502
SMILESCC[C@H](N)C(=O)N1CCC[C@H]1C(N)=O