Reaction Details
TargetTripeptidyl-peptidase 2
LigandBDBM50176937
Substrate/Competitorn/a
Meas. Tech.ChEMBL_430943 (CHEMBL914885)
Ki 190000±n/a nM
Citation Ganellin, CRBishop, PBBambal, RBChan, SMLeblond, BMoore, ANZhao, LBourgeat, PRose, CVargas, FSchwartz, JC Inhibitors of tripeptidyl peptidase II. 3. Derivation of butabindide by successive structure optimizations leading to a potential general approach to designing exopeptidase inhibitors. J Med Chem48:7333-42 (2005) 
 
Tripeptidyl-peptidase 2
Name:Tripeptidyl-peptidase 2
Type:PROTEIN
Mol. Mass.:138287.08
Organism:Rattus norvegicus
Description:ChEMBL_211948
Residue:1249
BDBM50176937
NameBDBM50176937
Synonyms:(R)-1-((S)-2-amino-3-methylbutanoyl)-N-butylpyrrolidine-2-carboxamide | CHEMBL224589
TypeSmall organic molecule
Emp. Form.C14H27N3O2
Mol. Mass.269.3831
SMILESCCCCNC(=O)[C@H]1CCCN1C(=O)[C@@H](N)C(C)C