Reaction Details
TargetTripeptidyl-peptidase 2
LigandBDBM50176942
Substrate/Competitorn/a
Meas. Tech.ChEMBL_430943 (CHEMBL914885)
Ki 40000±n/a nM
Citation Ganellin, CRBishop, PBBambal, RBChan, SMLeblond, BMoore, ANZhao, LBourgeat, PRose, CVargas, FSchwartz, JC Inhibitors of tripeptidyl peptidase II. 3. Derivation of butabindide by successive structure optimizations leading to a potential general approach to designing exopeptidase inhibitors. J Med Chem48:7333-42 (2005) 
 
Tripeptidyl-peptidase 2
Name:Tripeptidyl-peptidase 2
Type:PROTEIN
Mol. Mass.:138287.08
Organism:Rattus norvegicus
Description:ChEMBL_211948
Residue:1249
BDBM50176942
NameBDBM50176942
Synonyms:(2S)-aminobutyryl-4-thia-L-prolinamide | CHEMBL375212
TypeSmall organic molecule
Emp. Form.C8H15N3O2S
Mol. Mass.217.289
SMILESCC[C@H](N)C(=O)N1CSC[C@@H]1C(N)=O