Reaction Details
TargetTripeptidyl-peptidase 2
LigandBDBM50176944
Substrate/Competitorn/a
Meas. Tech.ChEMBL_430943 (CHEMBL914885)
Ki 6000±n/a nM
Citation Ganellin, CRBishop, PBBambal, RBChan, SMLeblond, BMoore, ANZhao, LBourgeat, PRose, CVargas, FSchwartz, JC Inhibitors of tripeptidyl peptidase II. 3. Derivation of butabindide by successive structure optimizations leading to a potential general approach to designing exopeptidase inhibitors. J Med Chem48:7333-42 (2005) 
 
Tripeptidyl-peptidase 2
Name:Tripeptidyl-peptidase 2
Type:PROTEIN
Mol. Mass.:138287.08
Organism:Rattus norvegicus
Description:ChEMBL_211948
Residue:1249
BDBM50176944
NameBDBM50176944
Synonyms:1-((S)-2-aminobutanoyl)-N-butylazepane-2-carboxamide | CHEMBL223953
TypeSmall organic molecule
Emp. Form.C15H29N3O2
Mol. Mass.283.4097
SMILESCCCCNC(=O)C1CCCCCN1C(=O)[C@@H](N)CC