Reaction Details
TargetRho-associated protein kinase 1/2
LigandBDBM50196690
Substrate/Competitorn/a
Meas. Tech.ChEMBL_432047 (CHEMBL918244)
IC50 10±n/a nM
Citation Iwakubo, MTakami, AOkada, YKawata, TTagami, YOhashi, HSato, MSugiyama, TFukushima, KIijima, H Design and synthesis of Rho kinase inhibitors (II). Bioorg Med Chem15:350-64 (2006) 
 
Rho-associated protein kinase 1/2
Name:Rho-associated protein kinase 1/2
Type:n/a
Mol. Mass.:n/a
Description:ASSAY_ID of EBI is 432392
Components:This complex has 2 components.
Component 1
Name:Rho-associated protein kinase 1
Synonyms:ROCK-I ROCK1_HUMAN Rho-associated protein kinase Rho-associated, coiled-coil-containing protein kinase 1 Rho-kinase (ROCK I) p160 ROCK-1 | p160ROCK
Type:Serine/threonine-protein kinase
Mol. Mass.:158156.77
Organism:Homo sapiens (Human)
Description:Q13464
Residue:1354
Component 2
Name:Rho-associated protein kinase 2
Synonyms:KIAA0619 ROCK2 Rho kinase 2 (ROCKII) Rho-associated protein kinase 2 (ROCK2) Rho-associated protein kinase 2/Transforming protein RhoA Rho-associated, coiled-coil-containing protein kinase II p164 ROCK-2
Type:Protein
Mol. Mass.:160885.43
Organism:Homo sapiens (Human)
Description:O75116
Residue:1388
Component 3
Name:Rho-associated protein kinase 2
Synonyms:KIAA0619 ROCK2 Rho kinase 2 (ROCKII) Rho-associated protein kinase 2 (ROCK2) Rho-associated protein kinase 2/Transforming protein RhoA Rho-associated, coiled-coil-containing protein kinase II p164 ROCK-2
Type:Protein
Mol. Mass.:160885.43
Organism:Homo sapiens (Human)
Description:O75116
Residue:1388
BDBM50196690
NameBDBM50196690
Synonyms:CHEMBL224535 N-[1-(4-aminobenzyl)-3-piperidyl]-N-(1H-5-indazolyl)amine
TypeSmall organic molecule
Emp. Form.C19H23N5
Mol. Mass.321.4194
SMILESNc1ccc(CN2CCCC(C2)Nc2ccc3[nH]ncc3c2)cc1