Reaction Details
TargetC-C chemokine receptor type 2
LigandBDBM50196690
Substrate/Competitorn/a
Meas. Tech.ChEMBL_432048 (CHEMBL918245)
IC50 2000±n/a nM
Citation Iwakubo, MTakami, AOkada, YKawata, TTagami, YOhashi, HSato, MSugiyama, TFukushima, KIijima, H Design and synthesis of Rho kinase inhibitors (II). Bioorg Med Chem15:350-64 (2006) 
 
C-C chemokine receptor type 2
Name:C-C chemokine receptor type 2
Type:Enzyme
Mol. Mass.:41932.32
Organism:Homo sapiens (Human)
Description:P41597
Residue:374
BDBM50196690
NameBDBM50196690
Synonyms:CHEMBL224535 N-[1-(4-aminobenzyl)-3-piperidyl]-N-(1H-5-indazolyl)amine
TypeSmall organic molecule
Emp. Form.C19H23N5
Mol. Mass.321.4194
SMILESNc1ccc(CN2CCCC(C2)Nc2ccc3[nH]ncc3c2)cc1