Reaction Details
TargetAndrogen receptor
LigandBDBM35909
Substrate/Competitorn/a
Meas. Tech.ChEMBL_432232 (CHEMBL914604)
IC50 200±n/a nM
Citation Tachibana, KImaoka, IYoshino, HEmura, TKodama, HFuruta, YKato, NNakamura, MOhta, MTaniguchi, KIshikura, NNagamuta, MOnuma, ESato, H Discovery of 7alpha-substituted dihydrotestosterones as androgen receptor pure antagonists and their structure-activity relationships. Bioorg Med Chem15:174-85 (2006) 
 
Androgen receptor
Name:Androgen receptor
Type:Receptor
Mol. Mass.:99185.27
Organism:Homo sapiens (Human)
Description:CHO cells were stably transfected with human AR gene.
Residue:920
BDBM35909
NameBDBM35909
Synonyms:2-Hydroxy-2-methyl-N-(4-nitro-3-trifluoromethyl-phenyl)-propionamide 2-Hydroxy-2-methyl-N-(4-nitro-3-trifluoromethyl-phenyl)-propionamide(Hydroxyflutamide) CHEMBL491 Hydroxyflutamide Sch 16423 cid_91649 | hydroxy-flutamide
TypeSmall organic molecule
Emp. Form.C11H11F3N2O4
Mol. Mass.292.2112
SMILESCC(C)(O)C(=O)Nc1ccc(c(c1)C(F)(F)F)[N+]([O-])=O