Reaction Details
TargetKappa-type opioid receptor
LigandBDBM50027231
Substrate/Competitorn/a
Meas. Tech.ChEMBL_434329 (CHEMBL917910)
Ki 0.130000±n/a nM
Citation Peng, XKnapp, BIBidlack, JMNeumeyer, JL Pharmacological properties of bivalent ligands containing butorphan linked to nalbuphine, naltrexone, and naloxone at mu, delta, and kappa opioid receptors. J Med Chem50:2254-8 (2007) 
 
Kappa-type opioid receptor
Name:Kappa-type opioid receptor
Type:G Protein-Coupled Receptor (GPCR)
Mol. Mass.:42648.76
Organism:Homo sapiens (Human)
Description:P41145
Residue:380
BDBM50027231
NameBDBM50027231
Synonyms:CHEMBL2113275
TypeSmall organic molecule
Emp. Form.C50H64N2O7
Mol. Mass.805.0524
SMILES[H][C@@]12Oc3c4c(C[C@@]5([H])N(CC=C)CC[C@@]14[C@@]5(O)CCC2=O)ccc3OC(=O)CCCCCCCCC(=O)Oc1ccc2C[C@]3([H])C4CCCC[C@]4(CCN3CC3CCC3)c2c1