Reaction Details
TargetKappa-type opioid receptor
LigandBDBM50135808
Substrate/Competitorn/a
Meas. Tech.ChEMBL_434329 (CHEMBL917910)
Ki 0.079000±n/a nM
Citation Peng, XKnapp, BIBidlack, JMNeumeyer, JL Pharmacological properties of bivalent ligands containing butorphan linked to nalbuphine, naltrexone, and naloxone at mu, delta, and kappa opioid receptors. J Med Chem50:2254-8 (2007) 
 
Kappa-type opioid receptor
Name:Kappa-type opioid receptor
Type:G Protein-Coupled Receptor (GPCR)
Mol. Mass.:42648.76
Organism:Homo sapiens (Human)
Description:P41145
Residue:380
BDBM50135808
NameBDBM50135808
Synonyms:(-)-3-Hydroxy-N-cyclobutylmethylmorphinan S(+)-Mandelate 3-Hydroxy-N-cyclobutylmethylmorphinan CHEMBL301160 | MCL-101
TypeSmall organic molecule
Emp. Form.C21H29NO
Mol. Mass.311.4611
SMILESOc1ccc2C[C@@H]3[C@@H]4CCCC[C@]4(CCN3CC3CCC3)c2c1