Reaction Details
TargetHistidinol dehydrogenase
LigandBDBM50267972
Substrate/Competitorn/a
Meas. Tech.ChEMBL_436509 (CHEMBL904815)
IC50 40±n/a nM
Citation Abdo, MRJoseph, PBoigegrain, RALiautard, JPMontero, JLKöhler, SWinum, JY Brucella suis histidinol dehydrogenase: synthesis and inhibition studies of a series of substituted benzylic ketones derived from histidine. Bioorg Med Chem15:4427-33 (2007) 
 
Histidinol dehydrogenase
Name:Histidinol dehydrogenase
Type:PROTEIN
Mol. Mass.:46060.70
Organism:Brucella suis
Description:ChEMBL_436509
Residue:430
BDBM50267972
NameBDBM50267972
Synonyms:(S)-3-Amino-4-(1H-imidazol-4-yl)-1-phenyl-butan-2-one; dihydrochloride CHEMBL500316
TypeSmall organic molecule
Emp. Form.C13H15N3O
Mol. Mass.229.2777
SMILESN[C@@H](Cc1cnc[nH]1)C(=O)Cc1ccccc1