Reaction Details
TargetSodium-dependent dopamine transporter
LigandBDBM50212378
Substrate/Competitorn/a
Meas. Tech.ChEMBL_436641 (CHEMBL904951)
Ki 90±n/a nM
Citation Kim, DIDeutsch, HMYe, XSchweri, MM Synthesis and pharmacology of site-specific cocaine abuse treatment agents: restricted rotation analogues of methylphenidate. J Med Chem50:2718-31 (2007) 
 
Sodium-dependent dopamine transporter
Name:Sodium-dependent dopamine transporter
Type:Multi-pass membrane protein
Mol. Mass.:68749.45
Organism:Rattus norvegicus (rat)
Description:P23977
Residue:619
BDBM50212378
NameBDBM50212378
Synonyms:CHEMBL537431 | threo-ritalinol methyl ether hydrochloride
TypeSmall organic molecule
Emp. Form.C14H21NO
Mol. Mass.219.3226
SMILESCOC[C@@H]([C@H]1CCCCN1)c1ccccc1