Reaction Details
TargetSodium-dependent dopamine transporter
LigandBDBM50212360
Substrate/Competitorn/a
Meas. Tech.ChEMBL_436641 (CHEMBL904951)
Ki 175±n/a nM
Citation Kim, DIDeutsch, HMYe, XSchweri, MM Synthesis and pharmacology of site-specific cocaine abuse treatment agents: restricted rotation analogues of methylphenidate. J Med Chem50:2718-31 (2007) 
 
Sodium-dependent dopamine transporter
Name:Sodium-dependent dopamine transporter
Type:Multi-pass membrane protein
Mol. Mass.:68749.45
Organism:Rattus norvegicus (rat)
Description:P23977
Residue:619
BDBM50212360
NameBDBM50212360
Synonyms:CHEMBL540625 | threo-1-aza-4alpha-hydroxy-4beta-ethyl-5-phenyl[4.4.0]decane hydrochloride
TypeSmall organic molecule
Emp. Form.C17H25NO
Mol. Mass.259.3865
SMILESCC[C@@]1(O)CCN2CCCC[C@@H]2[C@H]1c1ccccc1