Reaction Details
TargetTransporter
LigandBDBM50212359
Substrate/Competitorn/a
Meas. Tech.ChEMBL_436642 (CHEMBL904952)
Ki 28±n/a nM
Citation Kim, DIDeutsch, HMYe, XSchweri, MM Synthesis and pharmacology of site-specific cocaine abuse treatment agents: restricted rotation analogues of methylphenidate. J Med Chem50:2718-31 (2007) 
 
Transporter
Name:Transporter
Type:PROTEIN
Mol. Mass.:66787.87
Organism:Rattus norvegicus
Description:ChEMBL_1463061
Residue:597
BDBM50212359
NameBDBM50212359
Synonyms:CHEMBL558182 | threo-1-aza-4beta-hydroxy-5-(3,4-dichlorophenyl)[4.4.0]decane hydrochloride
TypeSmall organic molecule
Emp. Form.C15H19Cl2NO
Mol. Mass.300.223
SMILESO[C@H]1CCN2CCCC[C@@H]2[C@H]1c1ccc(Cl)c(Cl)c1