Reaction Details
TargetTransporter
LigandBDBM50212373
Substrate/Competitorn/a
Meas. Tech.ChEMBL_436642 (CHEMBL904952)
Ki 61±n/a nM
Citation Kim, DIDeutsch, HMYe, XSchweri, MM Synthesis and pharmacology of site-specific cocaine abuse treatment agents: restricted rotation analogues of methylphenidate. J Med Chem50:2718-31 (2007) 
 
Transporter
Name:Transporter
Type:PROTEIN
Mol. Mass.:66787.87
Organism:Rattus norvegicus
Description:ChEMBL_1463061
Residue:597
BDBM50212373
NameBDBM50212373
Synonyms:(1R,2S,9aR)-2-ethyl-1-phenyl-octahydro-1H-quinolizine hydrochloride hydrochloride | CHEMBL553714
TypeSmall organic molecule
Emp. Form.C17H25N
Mol. Mass.243.3871
SMILESCC[C@H]1CCN2CCCC[C@@H]2[C@H]1c1ccccc1