Reaction Details
TargetSodium-dependent dopamine transporter
LigandBDBM50212373
Substrate/Competitorn/a
Meas. Tech.ChEMBL_436641 (CHEMBL904951)
Ki 5.5±n/a nM
Citation Kim, DIDeutsch, HMYe, XSchweri, MM Synthesis and pharmacology of site-specific cocaine abuse treatment agents: restricted rotation analogues of methylphenidate. J Med Chem50:2718-31 (2007) 
 
Sodium-dependent dopamine transporter
Name:Sodium-dependent dopamine transporter
Type:Multi-pass membrane protein
Mol. Mass.:68749.45
Organism:Rattus norvegicus (rat)
Description:P23977
Residue:619
BDBM50212373
NameBDBM50212373
Synonyms:(1R,2S,9aR)-2-ethyl-1-phenyl-octahydro-1H-quinolizine hydrochloride hydrochloride | CHEMBL553714
TypeSmall organic molecule
Emp. Form.C17H25N
Mol. Mass.243.3871
SMILESCC[C@H]1CCN2CCCC[C@@H]2[C@H]1c1ccccc1