Reaction Details
TargetTransporter
LigandBDBM50212357
Substrate/Competitorn/a
Meas. Tech.ChEMBL_436642 (CHEMBL904952)
Ki 138±n/a nM
Citation Kim, DIDeutsch, HMYe, XSchweri, MM Synthesis and pharmacology of site-specific cocaine abuse treatment agents: restricted rotation analogues of methylphenidate. J Med Chem50:2718-31 (2007) 
 
Transporter
Name:Transporter
Type:PROTEIN
Mol. Mass.:66787.87
Organism:Rattus norvegicus
Description:ChEMBL_1463061
Residue:597
BDBM50212357
NameBDBM50212357
Synonyms:CHEMBL537206 | threo-1-aza-5-phenyl[4.4.0]decane hydrochloride
TypeSmall organic molecule
Emp. Form.C15H21N
Mol. Mass.215.3339
SMILESC1CCN2CCC[C@@H]([C@H]2C1)c1ccccc1