Reaction Details
TargetTransporter
LigandBDBM50212381
Substrate/Competitorn/a
Meas. Tech.ChEMBL_436642 (CHEMBL904952)
Ki 64±n/a nM
Citation Kim, DIDeutsch, HMYe, XSchweri, MM Synthesis and pharmacology of site-specific cocaine abuse treatment agents: restricted rotation analogues of methylphenidate. J Med Chem50:2718-31 (2007) 
 
Transporter
Name:Transporter
Type:PROTEIN
Mol. Mass.:66787.87
Organism:Rattus norvegicus
Description:ChEMBL_1463061
Residue:597
BDBM50212381
NameBDBM50212381
Synonyms:CHEMBL537874 | threo-1-aza-4beta-methoxy-5-phenyl[4.4.0]decane hydrochloride
TypeSmall organic molecule
Emp. Form.C16H23NO
Mol. Mass.245.3599
SMILESCO[C@H]1CCN2CCCC[C@@H]2[C@H]1c1ccccc1