Reaction Details
TargetTyrosine-protein phosphatase non-receptor type 1
LigandBDBM50212400
Substrate/Competitorn/a
Meas. Tech.ChEMBL_436656 (CHEMBL904966)
IC50 16900±n/a nM
Citation Cui, LNdinteh, DTNa, MThuong, PTSilike-Muruumu, JNjamen, DMbafor, JTFomum, ZTAhn, JSOh, WK Isoprenylated flavonoids from the stem bark of Erythrina abyssinica. J Nat Prod70:1039-42 (2007) 
 
Tyrosine-protein phosphatase non-receptor type 1
Name:Tyrosine-protein phosphatase non-receptor type 1
Type:Protein phosphatase
Mol. Mass.:49963.76
Organism:Homo sapiens (Human)
Description:Human recombinant GST-fusion PTP1B (1-435).
Residue:435
BDBM50212400
NameBDBM50212400
Synonyms:1-(2,4-Dihydroxyphenyl)-3-[4-hydroxy-3-(3-methylbut-2-enyl)phenyl]-prop-2-en-1-one CHEMBL229885 | licoagrochalcone A
TypeSmall organic molecule
Emp. Form.C20H20O4
Mol. Mass.324.3704
SMILES[#6]\[#6](-[#6])=[#6]/[#6]-c1cc(\[#6]=[#6]\[#6](=O)-c2ccc(-[#8])cc2-[#8])ccc1-[#8]