Reaction Details
TargetPotassium voltage-gated channel subfamily A member 5
LigandBDBM50213094
Substrate/Competitorn/a
Meas. Tech.ChEMBL_436809 (CHEMBL905111)
IC50 3600±n/a nM
Citation Plouvier, BBeatch, GNJung, GLZolotoy, ASheng, TClohs, LBarrett, TDFedida, DWang, WQZhu, JJLiu, YAbraham, SLynn, LDong, YWall, RAWalker, MJ Synthesis and biological studies of novel 2-aminoalkylethers as potential antiarrhythmic agents for the conversion of atrial fibrillation. J Med Chem50:2818-41 (2007) 
 
Potassium voltage-gated channel subfamily A member 5
Name:Potassium voltage-gated channel subfamily A member 5
Type:Enzyme
Mol. Mass.:67222.47
Organism:Homo sapiens (Human)
Description:P22460
Residue:613
BDBM50213094
NameBDBM50213094
Synonyms:(1R,2R)-1-(3,4-dichlorophenethoxy)-2-(4-morpholinyl)cyclohexane | CHEMBL387935
TypeSmall organic molecule
Emp. Form.C18H25Cl2NO2
Mol. Mass.358.303
SMILESClc1ccc(CCO[C@@H]2CCCC[C@H]2N2CCOCC2)cc1Cl