Reaction Details
TargetPotassium voltage-gated channel subfamily A member 5
LigandBDBM50131434
Substrate/Competitorn/a
Meas. Tech.ChEMBL_436809 (CHEMBL905111)
IC50 51000±n/a nM
Citation Plouvier, BBeatch, GNJung, GLZolotoy, ASheng, TClohs, LBarrett, TDFedida, DWang, WQZhu, JJLiu, YAbraham, SLynn, LDong, YWall, RAWalker, MJ Synthesis and biological studies of novel 2-aminoalkylethers as potential antiarrhythmic agents for the conversion of atrial fibrillation. J Med Chem50:2818-41 (2007) 
 
Potassium voltage-gated channel subfamily A member 5
Name:Potassium voltage-gated channel subfamily A member 5
Type:Enzyme
Mol. Mass.:67222.47
Organism:Homo sapiens (Human)
Description:P22460
Residue:613
BDBM50131434
NameBDBM50131434
Synonyms:CHEMBL652 N-(piperidin-2-ylmethyl)-2,5-bis(2,2,2-trifluoroethoxy)benzamide N-Piperidin-2-ylmethyl-2,5-bis-(2,2,2-trifluoro-ethoxy)-benzamide (Flecainide) N-Piperidin-2-ylmethyl-2,5-bis-(2,2,2-trifluoro-ethoxy)-benzamide(Flecanide) | Tambocor
TypeSmall organic molecule
Emp. Form.C17H20F6N2O3
Mol. Mass.414.3427
SMILESFC(F)(F)COc1ccc(OCC(F)(F)F)c(c1)C(=O)NCC1CCCCN1