Reaction Details
TargetGlucocorticoid receptor
LigandBDBM50197433
Substrate/Competitorn/a
Meas. Tech.ChEMBL_437577 (CHEMBL906013)
Ki 0.9±n/a nM
Citation Backes, BJHamilton, GLNguyen, PWilcox, DFung, SWang, JGrynfarb, MGoos-Nilsson, AJacobson, PBvon Geldern, TW Parallel strategies for the preparation and selection of liver-targeted glucocorticoid receptor antagonists. Bioorg Med Chem Lett17:40-4 (2006) 
 
Glucocorticoid receptor
Name:Glucocorticoid receptor
Type:Enzyme
Mol. Mass.:85656.87
Organism:Homo sapiens (Human)
Description:P04150
Residue:777
BDBM50197433
NameBDBM50197433
Synonyms:4-{[(4-bromo-phenyl)-(2-{[4-((9S,11R,13S,14S,17S)-17-hydroxy-13-methyl-3-oxo-17-prop-1-ynyl-2,3,6,7,8,11,12,13,14,15,16,17-dodecahydro-1H-cyclopenta[a]phenanthren-11-yl)-phenyl]-methyl-amino}-acetyl)-amino]-methyl}-benzoic acid | CHEMBL388018
TypeSmall organic molecule
Emp. Form.C44H45BrN2O5
Mol. Mass.761.743
SMILESCC#C[C@]1(O)CC[C@H]2[C@@H]3CCC4=CC(=O)CCC4=C3[C@H](C[C@]12C)c1ccc(cc1)N(C)CC(=O)N(Cc1ccc(cc1)C(O)=O)c1ccc(Br)cc1