Reaction Details
TargetProto-oncogene tyrosine-protein kinase Src
LigandBDBM50198798
Substrate/Competitorn/a
Meas. Tech.ChEMBL_437736 (CHEMBL905921)
IC50 1800±n/a nM
Citation Noronha, GBarrett, KBoccia, ABrodhag, TCao, JChow, CPDneprovskaia, EDoukas, JFine, RGong, XGritzen, CGu, HHanna, EHood, JDHu, SKang, XKey, JKlebansky, BKousba, ALi, GLohse, DMak, CCMcPherson, APalanki, MSPathak, VPRenick, JShi, FSoll, RSplittgerber, UStoughton, STang, SYee, SZeng, BZhao, NZhu, H Discovery of [7-(2,6-dichlorophenyl)-5-methylbenzo [1,2,4]triazin-3-yl]-[4-(2-pyrrolidin-1-ylethoxy)phenyl]amine--a potent, orally active Src kinase inhibitor with anti-tumor activity in preclinical assays. Bioorg Med Chem Lett17:602-8 (2007) 
 
Proto-oncogene tyrosine-protein kinase Src
Name:Proto-oncogene tyrosine-protein kinase Src
Type:Protein
Mol. Mass.:59838.60
Organism:Homo sapiens (Human)
Description:P12931
Residue:536
BDBM50198798
NameBDBM50198798
Synonyms:5-methyl-7-(pyridin-2-yl)-N-(4-(2-(pyrrolidin-1-yl)ethoxy)phenyl)benzo[e][1,2,4]triazin-3-amine US8481536, 373
TypeSmall organic molecule
Emp. Form.C25H26N6O
Mol. Mass.426.5135
SMILESCc1cc(cc2nnc(Nc3ccc(OCCN4CCCC4)cc3)nc12)-c1ccccn1