Reaction Details
TargetProto-oncogene tyrosine-protein kinase Src
LigandBDBM50198806
Substrate/Competitorn/a
Meas. Tech.ChEMBL_437736 (CHEMBL905921)
IC50 36±n/a nM
Citation Noronha, GBarrett, KBoccia, ABrodhag, TCao, JChow, CPDneprovskaia, EDoukas, JFine, RGong, XGritzen, CGu, HHanna, EHood, JDHu, SKang, XKey, JKlebansky, BKousba, ALi, GLohse, DMak, CCMcPherson, APalanki, MSPathak, VPRenick, JShi, FSoll, RSplittgerber, UStoughton, STang, SYee, SZeng, BZhao, NZhu, H Discovery of [7-(2,6-dichlorophenyl)-5-methylbenzo [1,2,4]triazin-3-yl]-[4-(2-pyrrolidin-1-ylethoxy)phenyl]amine--a potent, orally active Src kinase inhibitor with anti-tumor activity in preclinical assays. Bioorg Med Chem Lett17:602-8 (2007) 
 
Proto-oncogene tyrosine-protein kinase Src
Name:Proto-oncogene tyrosine-protein kinase Src
Type:Protein
Mol. Mass.:59838.60
Organism:Homo sapiens (Human)
Description:P12931
Residue:536
BDBM50198806
NameBDBM50198806
Synonyms:7-(2,6-dimethylphenyl)-5-methyl-N-(4-(2-(4-methylpiperazin-1-yl)propoxy)phenyl)benzo[e][1,2,4]triazin-3-amine | CHEMBL230718
TypeSmall organic molecule
Emp. Form.C30H36N6O
Mol. Mass.496.6464
SMILESCC(COc1ccc(Nc2nnc3cc(cc(C)c3n2)-c2c(C)cccc2C)cc1)N1CCN(C)CC1