Reaction Details
TargetProto-oncogene tyrosine-protein kinase Src
LigandBDBM50198824
Substrate/Competitorn/a
Meas. Tech.ChEMBL_437736 (CHEMBL905921)
IC50 13±n/a nM
Citation Noronha, GBarrett, KBoccia, ABrodhag, TCao, JChow, CPDneprovskaia, EDoukas, JFine, RGong, XGritzen, CGu, HHanna, EHood, JDHu, SKang, XKey, JKlebansky, BKousba, ALi, GLohse, DMak, CCMcPherson, APalanki, MSPathak, VPRenick, JShi, FSoll, RSplittgerber, UStoughton, STang, SYee, SZeng, BZhao, NZhu, H Discovery of [7-(2,6-dichlorophenyl)-5-methylbenzo [1,2,4]triazin-3-yl]-[4-(2-pyrrolidin-1-ylethoxy)phenyl]amine--a potent, orally active Src kinase inhibitor with anti-tumor activity in preclinical assays. Bioorg Med Chem Lett17:602-8 (2007) 
 
Proto-oncogene tyrosine-protein kinase Src
Name:Proto-oncogene tyrosine-protein kinase Src
Type:Protein
Mol. Mass.:59838.60
Organism:Homo sapiens (Human)
Description:P12931
Residue:536
BDBM50198824
NameBDBM50198824
Synonyms:4-(7-(2,6-dimethylphenyl)-5-methylbenzo[e][1,2,4]triazin-3-ylamino)-N-(piperazin-1-yl)benzamide | CHEMBL230720
TypeSmall organic molecule
Emp. Form.C27H29N7O
Mol. Mass.467.5655
SMILESCc1cccc(C)c1-c1cc(C)c2nc(Nc3ccc(cc3)C(=O)NN3CCNCC3)nnc2c1